Reaction Details
TargetPro-glucagon
LigandBDBM2437
Substrate/Competitorn/a
Meas. Tech.Glucagon SPA Assay
Ki 5.55±n/a nM
Citation Aspnes, GEDidiuk, MTFilipski, KJGuzman-Perez, ALee, ECPfefferkorn, JAStevens, BDTu, MM Glucagon receptor modulators US Patent US8507533 Publication Date 8/13/2013
 
Pro-glucagon
Name:Pro-glucagon
Type:Enzyme
Mol. Mass.:20907.95
Organism:Homo sapiens (Human)
Description:P01275
Residue:180
BDBM2437
NameBDBM2437
Synonyms:US8507533, 157
Typen/a
Emp. Form.C25H27F3N6O3
Mol. Mass.516.5155
SMILESCC1(C)CC(C1)C(Nc1cnc(nc1)-n1cc(cn1)C(F)(F)F)c1ccc(cc1)C(=O)NCCC(O)=O