Reaction Details
TargetCalcitonin gene-related peptide type 1 receptor
LigandBDBM100873
Substrate/Competitorn/a
Meas. Tech.Binding Assay
Ki 0.49±0.0 nM
Citation Wood, MRBell, IMKim, JJSelnick, HGStump, CA 3- and 6-quinolines with N-attached heterocyclic CGRP receptor antagonists US Patent US8507477 Publication Date 8/13/2013
 
Calcitonin gene-related peptide type 1 receptor
Name:Calcitonin gene-related peptide type 1 receptor
Type:Enzyme Catalytic Domain
Mol. Mass.:52980.45
Organism:Homo sapiens (Human)
Description:Q16602
Residue:461
BDBM100873
NameBDBM100873
Synonyms:US8507477, 15
TypeSmall organic molecule
Emp. Form.C34H31F2N5O2
Mol. Mass.579.639
SMILESFc1cc(F)cc(c1)[C@@H]1CCNC2(CCCC2)C(=O)N1Cc1cnc2cc3C[C@]4(Cc3cc2c1)C(=O)Nc1ncccc41