Reaction Details
TargetSphingosine 1-phosphate receptor 3
LigandBDBM101157
Substrate/Competitorn/a
Meas. Tech.Inhibition Assay
IC50 10±0.0 nM
Citation Beard, RLYuan, HDonello, JELiu, XDuong, T 6-substituted indole-3-carboxylic acid amide compounds having sphingosine-1-phosphate (S1P) receptor antagonist biological activity US Patent US8524917 Publication Date 9/3/2013
 
Sphingosine 1-phosphate receptor 3
Name:Sphingosine 1-phosphate receptor 3
Type:G Protein-Coupled Receptor (GPCR)
Mol. Mass.:42278.13
Organism:Homo sapiens (Human)
Description:Q99500
Residue:378
BDBM101157
NameBDBM101157
Synonyms:US8524917, 130 | US8524917, 165
TypeSmall organic molecule
Emp. Form.C28H29F2N3O2
Mol. Mass.477.5456
SMILESCC(C)Oc1ccc2c(C(=O)NCc3ccc(F)c(F)c3)c(C(C)C)n(Cc3ccccn3)c2c1