Reaction Details
TargetAmine oxidase [flavin-containing] A
LigandBDBM101273
Substrate/Competitorn/a
Meas. Tech.Biological Assay
Ki 2.21e+4±n/a nM
Citation Guibourt, NMunoz, AOLaria, JC Oxidase inhibitors and their use US Patent US8524717 Publication Date 9/3/2013
 
Amine oxidase [flavin-containing] A
Name:Amine oxidase [flavin-containing] A
Type:Protein
Mol. Mass.:59689.53
Organism:Homo sapiens (Human)
Description:P21397
Residue:527
BDBM101273
NameBDBM101273
Synonyms:US8524717, 28
TypeSmall organic molecule
Emp. Form.C23H28FN3O2
Mol. Mass.397.4857
SMILESCN1CCN(CC1)C(=O)CN[C@H]1C[C@@H]1c1ccc(OCc2cccc(F)c2)cc1