Reaction Details
TargetAmine oxidase [flavin-containing] A
LigandBDBM101298
Substrate/Competitorn/a
Meas. Tech.Biological Assay
Ki 2.59e+4±n/a nM
Citation Guibourt, NMunoz, AOLaria, JC Oxidase inhibitors and their use US Patent US8524717 Publication Date 9/3/2013
 
Amine oxidase [flavin-containing] A
Name:Amine oxidase [flavin-containing] A
Type:Protein
Mol. Mass.:59689.53
Organism:Homo sapiens (Human)
Description:P21397
Residue:527
BDBM101298
NameBDBM101298
Synonyms:US8524717, 53
TypeSmall organic molecule
Emp. Form.C23H28FN3O2
Mol. Mass.397.4857
SMILESCOc1cc(F)ccc1-c1ccc(cc1)[C@H]1C[C@@H]1NCC(=O)N1CCN(C)CC1