Reaction Details
TargetAmine oxidase [flavin-containing] B
LigandBDBM101276
Substrate/Competitorn/a
Meas. Tech.Biological Assay
Ki 6.4e+3±n/a nM
Citation Guibourt, NMunoz, AOLaria, JC Oxidase inhibitors and their use US Patent US8524717 Publication Date 9/3/2013
 
Amine oxidase [flavin-containing] B
Name:Amine oxidase [flavin-containing] B
Type:Protein
Mol. Mass.:58768.76
Organism:Homo sapiens (Human)
Description:P27338
Residue:520
BDBM101276
NameBDBM101276
Synonyms:US8524717, 31
TypeSmall organic molecule
Emp. Form.C23H28ClN3O2
Mol. Mass.413.94
SMILESCN1CCN(CC1)C(=O)CN[C@H]1C[C@@H]1c1ccc(OCc2ccc(Cl)cc2)cc1