Reaction Details
TargetAmine oxidase [flavin-containing] B
LigandBDBM101277
Substrate/Competitorn/a
Meas. Tech.Biological Assay
Ki 3.9e+3±n/a nM
Citation Guibourt, NMunoz, AOLaria, JC Oxidase inhibitors and their use US Patent US8524717 Publication Date 9/3/2013
 
Amine oxidase [flavin-containing] B
Name:Amine oxidase [flavin-containing] B
Type:Protein
Mol. Mass.:58768.76
Organism:Homo sapiens (Human)
Description:P27338
Residue:520
BDBM101277
NameBDBM101277
Synonyms:US8524717, 32
TypeSmall organic molecule
Emp. Form.C23H28BrN3O2
Mol. Mass.458.391
SMILESCN1CCN(CC1)C(=O)CN[C@H]1C[C@@H]1c1ccc(OCc2cccc(Br)c2)cc1