Reaction Details
TargetAmine oxidase [flavin-containing] B
LigandBDBM101304
Substrate/Competitorn/a
Meas. Tech.Biological Assay
Ki 1.82e+4±n/a nM
Citation Guibourt, NMunoz, AOLaria, JC Oxidase inhibitors and their use US Patent US8524717 Publication Date 9/3/2013
 
Amine oxidase [flavin-containing] B
Name:Amine oxidase [flavin-containing] B
Type:Protein
Mol. Mass.:58768.76
Organism:Homo sapiens (Human)
Description:P27338
Residue:520
BDBM101304
NameBDBM101304
Synonyms:US8524717, 59
TypeSmall organic molecule
Emp. Form.C24H31N3O
Mol. Mass.377.5224
SMILESCN1CCN(CC1)C(=O)CN[C@H]1C[C@@H]1c1ccc(CCc2ccccc2)cc1