Reaction Details
TargetLysine-specific histone demethylase 1A
LigandBDBM101279
Substrate/Competitorn/a
Meas. Tech.Biological Assay
Ki 161±n/a nM
Citation Guibourt, NMunoz, AOLaria, JC Oxidase inhibitors and their use US Patent US8524717 Publication Date 9/3/2013
 
Lysine-specific histone demethylase 1A
Name:Lysine-specific histone demethylase 1A
Type:Enzyme
Mol. Mass.:92901.01
Organism:Homo sapiens (Human)
Description:O60341
Residue:852
BDBM101279
NameBDBM101279
Synonyms:US8524717, 34
TypeSmall organic molecule
Emp. Form.C24H31N3O2
Mol. Mass.393.5218
SMILESCN1CCN(CC1)C(=O)CN[C@H]1C[C@@H]1c1ccc(OCCc2ccccc2)cc1