Reaction Details
TargetGlutaminyl-peptide cyclotransferase
LigandBDBM3742
Substrate/Competitorn/a
Meas. Tech.Spectrophotometric Assay
Temperature303.15±0 K
Ki 11.9±0.0 nM
IC50 73.1±0.0 nM
Citation Heiser, URamsbeck, D Inhibitors US Patent US8530670 Publication Date 9/10/2013
 
Glutaminyl-peptide cyclotransferase
Name:Glutaminyl-peptide cyclotransferase
Type:Enzyme
Mol. Mass.:40877.05
Organism:Homo sapiens (Human)
Description:Q16769
Residue:361
BDBM3742
NameBDBM3742
Synonyms:US8530670, 4
Typen/a
Emp. Form.C21H20N4O3
Mol. Mass.376.4085
SMILESO=C1CC(=O)N(C1c1ccc(cc1)N1CCOCC1)c1ccc2nc[nH]c2c1