Reaction Details
TargetOpioid growth factor receptor-like protein 1
LigandBDBM3916
Substrate/Competitorn/a
Meas. Tech.Binding Assay
Ki 1295.55±0 nM
Citation Kyle, DJGoehring, RRFundytus, ME Buprenophine analogs US Patent US8530494 Publication Date 9/10/2013
 
Opioid growth factor receptor-like protein 1
Name:Opioid growth factor receptor-like protein 1
Type:Protein
Mol. Mass.:51247.53
Organism:Homo sapiens (Human)
Description:Q5TC84
Residue:451
BDBM3916
NameBDBM3916
Synonyms:US8530494, 206
Typen/a
Emp. Form.C29H33Cl2NO4
Mol. Mass.530.483
SMILESCOc1ccc2C[C@H]3N(C)CC[C@@]45[C@@H](Oc1c24)[C@]1(CC[C@@]35C[C@@H]1COCc1ccc(Cl)c(Cl)c1)OC