Reaction Details
TargetKappa-type opioid receptor
LigandBDBM4267
Substrate/Competitorn/a
Meas. Tech.Binding Assay
Ki 0.17±0 nM
Citation Kyle, DJGoehring, RRFundytus, ME Buprenophine analogs US Patent US8530494 Publication Date 9/10/2013
 
Kappa-type opioid receptor
Name:Kappa-type opioid receptor
Type:G Protein-Coupled Receptor (GPCR)
Mol. Mass.:42648.76
Organism:Homo sapiens (Human)
Description:P41145
Residue:380
BDBM4267
NameBDBM4267
Synonyms:US8530494, 11
Typen/a
Emp. Form.C29H35NO4
Mol. Mass.461.5925
SMILESCOc1ccc2C[C@H]3N(C)CC[C@@]45C(Oc1c24)C1(CCC35CC1COCc1ccccc1)OC