Reaction Details
TargetKappa-type opioid receptor
LigandBDBM4049
Substrate/Competitorn/a
Meas. Tech.Binding Assay
Ki 0.07±0 nM
Citation Kyle, DJGoehring, RRFundytus, ME Buprenophine analogs US Patent US8530494 Publication Date 9/10/2013
 
Kappa-type opioid receptor
Name:Kappa-type opioid receptor
Type:G Protein-Coupled Receptor (GPCR)
Mol. Mass.:42648.76
Organism:Homo sapiens (Human)
Description:P41145
Residue:380
BDBM4049
NameBDBM4049
Synonyms:US8530494, 111
Typen/a
Emp. Form.C33H41NO4
Mol. Mass.515.6829
SMILESCOc1ccc2C[C@H]3N(CC4CC4)CC[C@@]45[C@@H](Oc1c24)[C@]1(CC[C@@]35C[C@@H]1COCc1ccccc1C)OC