Reaction Details
TargetCorticotropin-releasing factor receptor 1
LigandBDBM101643
Substrate/Competitorn/a
Meas. Tech.Binding Assay
IC50 39±0.0 nM
Citation Shin, KTerauchi, TTakahashi, YHashizume, MTakeda, KShikata, KInomata, A Pyrazolothiazole compound US Patent US8530504 Publication Date 9/10/2013
 
Corticotropin-releasing factor receptor 1
Name:Corticotropin-releasing factor receptor 1
Type:Enzyme
Mol. Mass.:50744.31
Organism:Homo sapiens (Human)
Description:P34998
Residue:444
BDBM101643
NameBDBM101643
Synonyms:US8530504, 2
TypeSmall organic molecule
Emp. Form.C23H33N3O3S2
Mol. Mass.463.656
SMILESCCCN(CCC)c1c(C)nn2c(c(SC)sc12)-c1c(OC)cc(COC)cc1OC