Reaction Details
TargetCorticotropin-releasing factor receptor 1
LigandBDBM101665
Substrate/Competitorn/a
Meas. Tech.Binding Assay
IC50 33±0.0 nM
Citation Shin, KTerauchi, TTakahashi, YHashizume, MTakeda, KShikata, KInomata, A Pyrazolothiazole compound US Patent US8530504 Publication Date 9/10/2013
 
Corticotropin-releasing factor receptor 1
Name:Corticotropin-releasing factor receptor 1
Type:Enzyme
Mol. Mass.:50744.31
Organism:Homo sapiens (Human)
Description:P34998
Residue:444
BDBM101665
NameBDBM101665
Synonyms:US8530504, 26
TypeSmall organic molecule
Emp. Form.C24H31N3O4S
Mol. Mass.457.586
SMILESCOc1nn2c(csc2c1N(CC1CC1)CC1CCOC1)-c1c(OC)cc(C)cc1OC