Reaction Details
TargetCorticotropin-releasing factor receptor 1
LigandBDBM101681
Substrate/Competitorn/a
Meas. Tech.Binding Assay
IC50 45±0.0 nM
Citation Shin, KTerauchi, TTakahashi, YHashizume, MTakeda, KShikata, KInomata, A Pyrazolothiazole compound US Patent US8530504 Publication Date 9/10/2013
 
Corticotropin-releasing factor receptor 1
Name:Corticotropin-releasing factor receptor 1
Type:Enzyme
Mol. Mass.:50744.31
Organism:Homo sapiens (Human)
Description:P34998
Residue:444
BDBM101681
NameBDBM101681
Synonyms:US8530504, 43
TypeSmall organic molecule
Emp. Form.C24H33N3O5S
Mol. Mass.475.601
SMILESCOCc1cc(OC)c(-c2csc3c(N(CC(C)C)C4CCOC4)c(OC)nn23)c(OC)c1