Reaction Details
TargetCorticotropin-releasing factor receptor 1
LigandBDBM101694
Substrate/Competitorn/a
Meas. Tech.Binding Assay
IC50 31±0.0 nM
Citation Shin, KTerauchi, TTakahashi, YHashizume, MTakeda, KShikata, KInomata, A Pyrazolothiazole compound US Patent US8530504 Publication Date 9/10/2013
 
Corticotropin-releasing factor receptor 1
Name:Corticotropin-releasing factor receptor 1
Type:Enzyme
Mol. Mass.:50744.31
Organism:Homo sapiens (Human)
Description:P34998
Residue:444
BDBM101694
NameBDBM101694
Synonyms:US8530504, 56
TypeSmall organic molecule
Emp. Form.C23H31N3O5S
Mol. Mass.461.574
SMILESCOCCN(C1CCC1)c1c(OC)nn2c(csc12)-c1c(OC)cc(COC)cc1OC