Reaction Details
TargetProstaglandin D2 receptor 2
LigandBDBM102436
Substrate/Competitorn/a
Meas. Tech.Radioligand Binding Assay
Ki 2±0.0 nM
Citation Armer, REPettipher, ERWhittaker, MWynne, GMVile, JSchroer, F Compounds having CRTH2 antagonist activity US Patent US8536158 Publication Date 9/17/2013
 
Prostaglandin D2 receptor 2
Name:Prostaglandin D2 receptor 2
Type:Enzyme
Mol. Mass.:43295.45
Organism:Homo sapiens (Human)
Description:Q9Y5Y4
Residue:395
BDBM102436
NameBDBM102436
Synonyms:US8536158, 2
TypeSmall organic molecule
Emp. Form.C23H18F2N2O4S
Mol. Mass.456.462
SMILESCc1c(Cc2cccnc2S(=O)(=O)c2ccc(F)cc2)c2cc(F)ccc2n1CC(O)=O