Reaction Details
TargetGuanylate cyclase soluble subunit alpha-1
LigandBDBM280796
Substrate/Competitorn/a
Meas. Tech.sGC Binding Assay
pH7.4±n/a
Ki 0.075±n/a nM
Commentsextracted
Citation Berger, RChen, YLi, GGarfunkle, JLi, HMiao, SRaghavan, SSmith, CJStelmach, JWhitehead, AZhang, RZhang, YFu, JJi, GJiang, F Soluble guanylate cyclase stimulators US Patent US10030027 Publication Date 7/24/2018
 
Guanylate cyclase soluble subunit alpha-1
Name:Guanylate cyclase soluble subunit alpha-1
Type:Enzyme
Mol. Mass.:77457.21
Organism:Homo sapiens (Human)
Description:Q02108
Residue:690
BDBM280796
NameBDBM280796
Synonyms:(S)-3-(4-{4-amino-2-[6- chloro-1-(2,6- difluorobenzyl)-1H-indazol- 3-yl]-5-methyl-6-oxo-6,7- dihydro-5H-pyrrolo[2,3- d]pyrimidin-5- yl}phenyl)propanoic acid US10428076, Example 64B
TypeSmall organic molecule
Emp. Form.C30H23ClF2N6O3
Mol. Mass.588.992
SMILESC[C@]1(C(=O)Nc2nc(nc(N)c12)-c1nn(Cc2c(F)cccc2F)c2cc(Cl)ccc12)c1ccc(CCC(O)=O)cc1