Reaction Details
TargetGuanylate cyclase soluble subunit alpha-1
LigandBDBM280846
Substrate/Competitorn/a
Meas. Tech.sGC Binding Assay
pH7.4±n/a
Ki 0.057±n/a nM
Commentsextracted
Citation Berger, RChen, YLi, GGarfunkle, JLi, HMiao, SRaghavan, SSmith, CJStelmach, JWhitehead, AZhang, RZhang, YFu, JJi, GJiang, F Soluble guanylate cyclase stimulators US Patent US10030027 Publication Date 7/24/2018
 
Guanylate cyclase soluble subunit alpha-1
Name:Guanylate cyclase soluble subunit alpha-1
Type:Enzyme
Mol. Mass.:77457.21
Organism:Homo sapiens (Human)
Description:Q02108
Residue:690
BDBM280846
NameBDBM280846
Synonyms:4-(2-{4-amino-2-[6- chloro-1-(2-fluorobenzyl)- 1H-indazol-3-yl]-5- methyl-6-oxo-6,7- dihydro-5H-pyrrolo[2,3- d]pyrimidin-5-yl}-1,3- oxazol-4-yl)-2,2- difluorobutanoic acid US10428076, Example 127A
TypeSmall organic molecule
Emp. Form.C28H21ClF3N7O4
Mol. Mass.611.959
SMILESCC1(C(=O)Nc2nc(nc(N)c12)-c1nn(Cc2ccccc2F)c2cc(Cl)ccc12)c1nc(CCC(F)(F)C(O)=O)co1