Reaction Details
TargetGuanylate cyclase soluble subunit alpha-1
LigandBDBM280876
Substrate/Competitorn/a
Meas. Tech.sGC Binding Assay
pH7.4±n/a
Ki 0.031±n/a nM
Commentsextracted
Citation Berger, RChen, YLi, GGarfunkle, JLi, HMiao, SRaghavan, SSmith, CJStelmach, JWhitehead, AZhang, RZhang, YFu, JJi, GJiang, F Soluble guanylate cyclase stimulators US Patent US10030027 Publication Date 7/24/2018
 
Guanylate cyclase soluble subunit alpha-1
Name:Guanylate cyclase soluble subunit alpha-1
Type:Enzyme
Mol. Mass.:77457.21
Organism:Homo sapiens (Human)
Description:Q02108
Residue:690
BDBM280876
NameBDBM280876
Synonyms:3-(2-{4-amino- 2-[1-(cyclohexyl- methyl)-1H- pyrazolo[3,4-b] pyridin-3-yl]-5- methyl-6-oxo- 6,7-dihydro-5H- pyrrolo[2,3-d] pyrimidin-5-yl}- 1,3-oxazol-4-yl)- 2,2-dimethyl- propanoic acid US10428076, Example 152A
TypeSmall organic molecule
Emp. Form.C28H32N8O4
Mol. Mass.544.6049
SMILESCC(C)(Cc1coc(n1)C1(C)C(=O)Nc2nc(nc(N)c12)-c1nn(CC2CCCCC2)c2ncccc12)C(O)=O