Reaction Details
TargetGuanylate cyclase soluble subunit alpha-1
LigandBDBM280934
Substrate/Competitorn/a
Meas. Tech.sGC Binding Assay
pH7.4±n/a
Ki 0.072±n/a nM
Commentsextracted
Citation Berger, RChen, YLi, GGarfunkle, JLi, HMiao, SRaghavan, SSmith, CJStelmach, JWhitehead, AZhang, RZhang, YFu, JJi, GJiang, F Soluble guanylate cyclase stimulators US Patent US10030027 Publication Date 7/24/2018
 
Guanylate cyclase soluble subunit alpha-1
Name:Guanylate cyclase soluble subunit alpha-1
Type:Enzyme
Mol. Mass.:77457.21
Organism:Homo sapiens (Human)
Description:Q02108
Residue:690
BDBM280934
NameBDBM280934
Synonyms:3-(2-{4-amino-2- [6-fluoro-1-(2- fluoro-3-methyl- benzyl)-1H- indazol-3-yl]-5- methyl-6-oxo- 6,7-dihydro-5H- pyrrolo[2,3-d] pyrimidin-5-yl}- 1,3-oxazol-4-yl)- 2,2-dimethyl- propanoic acid US10428076, Example 212A
TypeSmall organic molecule
Emp. Form.C30H27F2N7O4
Mol. Mass.587.5767
SMILESCc1cccc(Cn2nc(-c3nc4NC(=O)C(C)(c5nc(CC(C)(C)C(O)=O)co5)c4c(N)n3)c3ccc(F)cc23)c1F