Reaction Details
TargetGuanylate cyclase soluble subunit alpha-1
LigandBDBM280969
Substrate/Competitorn/a
Meas. Tech.sGC Binding Assay
pH7.4±n/a
Ki 0.063±n/a nM
Commentsextracted
Citation Berger, RChen, YLi, GGarfunkle, JLi, HMiao, SRaghavan, SSmith, CJStelmach, JWhitehead, AZhang, RZhang, YFu, JJi, GJiang, F Soluble guanylate cyclase stimulators US Patent US10030027 Publication Date 7/24/2018
 
Guanylate cyclase soluble subunit alpha-1
Name:Guanylate cyclase soluble subunit alpha-1
Type:Enzyme
Mol. Mass.:77457.21
Organism:Homo sapiens (Human)
Description:Q02108
Residue:690
BDBM280969
NameBDBM280969
Synonyms:5-{4-[(2H-tetrazol- 5-yl)methyl] phenyl}-4-amino- 2-[6-chloro-2-(2- fluorobenzyl)-1H- indazol-3-yl]-5- methyl-5,7- dihydro-6H- pyrrolo[2,3-d] pyrimidin-6-one US10428076, Example 244A
TypeSmall organic molecule
Emp. Form.C29H22ClFN10O
Mol. Mass.581.003
SMILESCC1(C(=O)Nc2nc(nc(N)c12)-c1nn(Cc2ccccc2F)c2cc(Cl)ccc12)c1ccc(Cc2nn[nH]n2)cc1