Reaction Details
TargetGuanylate cyclase soluble subunit alpha-1
LigandBDBM280974
Substrate/Competitorn/a
Meas. Tech.sGC Binding Assay
pH7.4±n/a
Ki 0.068±n/a nM
Commentsextracted
Citation Berger, RChen, YLi, GGarfunkle, JLi, HMiao, SRaghavan, SSmith, CJStelmach, JWhitehead, AZhang, RZhang, YFu, JJi, GJiang, F Soluble guanylate cyclase stimulators US Patent US10030027 Publication Date 7/24/2018
 
Guanylate cyclase soluble subunit alpha-1
Name:Guanylate cyclase soluble subunit alpha-1
Type:Enzyme
Mol. Mass.:77457.21
Organism:Homo sapiens (Human)
Description:Q02108
Residue:690
BDBM280974
NameBDBM280974
Synonyms:4-Amino-2-[6-fluoro-1-(2-fluorobenzyl)-1H-indazol-3-yl]-5-methyl-5-[3-(1H-tetrazol-5-yl)phenyl]-5,7-dihydro-6H-pyrrolo[2,3-d]pyrimidin-6-one | US10030027, Example 249B
TypeSmall organic molecule
Emp. Form.C28H20F2N10O
Mol. Mass.550.5216
SMILESCC1(C(=O)Nc2nc(nc(N)c12)-c1nn(Cc2ccccc2F)c2cc(F)ccc12)c1cccc(c1)-c1nn[nH]n1