Reaction Details
TargetGuanylate cyclase soluble subunit alpha-1
LigandBDBM280980
Substrate/Competitorn/a
Meas. Tech.sGC Binding Assay
pH7.4±n/a
Ki 0.073±n/a nM
Commentsextracted
Citation Berger, RChen, YLi, GGarfunkle, JLi, HMiao, SRaghavan, SSmith, CJStelmach, JWhitehead, AZhang, RZhang, YFu, JJi, GJiang, F Soluble guanylate cyclase stimulators US Patent US10030027 Publication Date 7/24/2018
 
Guanylate cyclase soluble subunit alpha-1
Name:Guanylate cyclase soluble subunit alpha-1
Type:Enzyme
Mol. Mass.:77457.21
Organism:Homo sapiens (Human)
Description:Q02108
Residue:690
BDBM280980
NameBDBM280980
Synonyms:6-{4-Amino-2-[6-chloro-1-(2-fluorobenzyl)-1H-indazol-3-yl]-5-methyl-6-oxo-6,7-dihydro-5H-pyrrolo[2,3-d]pyrimidin-5-yl}picolinic acid US10428076, Example 255A
TypeSmall organic molecule
Emp. Form.C27H19ClFN7O3
Mol. Mass.543.936
SMILESCC1(C(=O)Nc2nc(nc(N)c12)-c1nn(Cc2ccccc2F)c2cc(Cl)ccc12)c1cccc(n1)C(O)=O