Reaction Details
TargetEstrogen receptor
LigandBDBM102984
Substrate/Competitorn/a
Meas. Tech.Binding Assay
Ki 3.75±0.0 nM
Citation Dalton, JTSteiner, MSEswaraka, J Estrogen receptor ligands and methods of use thereof US Patent US8546451 Publication Date 10/1/2013
 
Estrogen receptor
Name:Estrogen receptor
Type:Protein
Mol. Mass.:66230.44
Organism:Homo sapiens (Human)
Description:P03372
Residue:595
BDBM102984
NameBDBM102984
Synonyms:US8546451, II
TypeSmall organic molecule
Emp. Form.C22H21NO3
Mol. Mass.347.407
SMILESCCCc1ccc(cc1)C(=O)N(c1ccc(O)cc1)c1ccc(O)cc1