Reaction Details
TargetAdhesin Ata autotransporter
LigandBDBM280996
Substrate/Competitorn/a
Meas. Tech.Antimicrobial Susceptibility Testing Assay
IC50 100.0±n/a nM
Citation Alanine, ABeignet, JBleicher, KFasching, BHilpert, HHu, TMacDonald, DJackson, SKolczewski, SKroll, CSchaeublin, AShen, HStoll, TThomas, HWahhab, AZampaloni, C Peptide macrocycles against acinetobacter baumannii US Patent US10030047 Publication Date 7/24/2018
 
Adhesin Ata autotransporter
Name:Adhesin Ata autotransporter
Type:Enzyme Catalytic Domain
Mol. Mass.:189662.81
Organism:Acinetobacter baumannii (strain ATCC 17978 / CIP 53.77 / LMG 1025 / NCDC KC755 / 5377)
Description:A3M3H0
Residue:1873
BDBM280996
NameBDBM280996
Synonyms:(12S,15S,18S)? 15,18-Bis-(3-amino-propyl)-4,6-dichloro-12-(1H-indol-3-ylmethyl)-13-methyl-2-thia-10,13,16,19-tetraaza-tricyclo[19.4.0.0*3,8*]pentacosa-1(25),3,5,7,21,23-hexaene-11,14,17-trione | US10030047, Example 133
TypeSmall organic molecule
Emp. Form.C36H43Cl2N7O3S
Mol. Mass.724.743
SMILESCN1[C@@H](Cc2c[nH]c3ccccc23)C(=O)NCc2cc(Cl)cc(Cl)c2Sc2ccccc2CN[C@@H](CCCN)C(=O)N[C@@H](CCCN)C1=O