Reaction Details
TargetGenome polyprotein
LigandBDBM32206
Substrate/Competitorn/a
Meas. Tech.Inhibition Assay
IC50 80±n/a nM
Citation Halim, RHarding, MHufton, RMorton, CJJahangiri, SPool, BRJeynes, TPDraffan, AGFrey, BLilly, MJ Viral polymerase inhibitors US Patent US8546389 Publication Date 10/1/2013
 
Genome polyprotein
Name:Genome polyprotein
Type:Protein
Mol. Mass.:329637.29
Organism:Hepatitis C virus genotype 3a (isolate NZL1) (HCV)
Description:Q81258
Residue:3021
BDBM32206
NameBDBM32206
Synonyms:US8546389, 66
Typen/a
Emp. Form.C24H27BrN4O5S
Mol. Mass.563.464
SMILESCNC(=O)c1n(nc2cc(N(CCCC(=O)OC)S(C)(=O)=O)c(cc12)C1CC1)-c1ccc(Br)cc1