Reaction Details
TargetGenome polyprotein
LigandBDBM32026
Substrate/Competitorn/a
Meas. Tech.Inhibition Assay
IC50 100±n/a nM
Citation Halim, RHarding, MHufton, RMorton, CJJahangiri, SPool, BRJeynes, TPDraffan, AGFrey, BLilly, MJ Viral polymerase inhibitors US Patent US8546389 Publication Date 10/1/2013
 
Genome polyprotein
Name:Genome polyprotein
Type:Protein
Mol. Mass.:327252.46
Organism:Hepatitis C virus genotype 1b (isolate BK) (HCV)
Description:P26663
Residue:3010
BDBM32026
NameBDBM32026
Synonyms:6-quinolinamine BDBM32208 SMR000036663 quinolin-6-amine
TypeSmall organic molecule
Emp. Form.C9H8N2
Mol. Mass.144.1732
SMILESNc1ccc2ncccc2c1