Reaction Details
TargetGenome polyprotein
LigandBDBM103285
Substrate/Competitorn/a
Meas. Tech.Inhibition Assay
IC50 2.6e+2±n/a nM
Citation Halim, RHarding, MHufton, RMorton, CJJahangiri, SPool, BRJeynes, TPDraffan, AGFrey, BLilly, MJ Viral polymerase inhibitors US Patent US8546389 Publication Date 10/1/2013
 
Genome polyprotein
Name:Genome polyprotein
Type:Protein
Mol. Mass.:327252.46
Organism:Hepatitis C virus genotype 1b (isolate BK) (HCV)
Description:P26663
Residue:3010
BDBM103285
NameBDBM103285
Synonyms:US8546389, 59
TypeSmall organic molecule
Emp. Form.C24H28BrN5O4S
Mol. Mass.562.479
SMILESCNC(=O)c1n(nc2cc(N(CCCNC(C)=O)S(C)(=O)=O)c(cc12)C1CC1)-c1ccc(Br)cc1