Reaction Details
TargetGenome polyprotein
LigandBDBM103285
Substrate/Competitorn/a
Meas. Tech.Inhibition Assay
IC50 5e+1±n/a nM
Citation Halim, RHarding, MHufton, RMorton, CJJahangiri, SPool, BRJeynes, TPDraffan, AGFrey, BLilly, MJ Viral polymerase inhibitors US Patent US8546389 Publication Date 10/1/2013
 
Genome polyprotein
Name:Genome polyprotein
Type:Protein
Mol. Mass.:329637.29
Organism:Hepatitis C virus genotype 3a (isolate NZL1) (HCV)
Description:Q81258
Residue:3021
BDBM103285
NameBDBM103285
Synonyms:US8546389, 59
TypeSmall organic molecule
Emp. Form.C24H28BrN5O4S
Mol. Mass.562.479
SMILESCNC(=O)c1n(nc2cc(N(CCCNC(C)=O)S(C)(=O)=O)c(cc12)C1CC1)-c1ccc(Br)cc1