Reaction Details
TargetGenome polyprotein
LigandBDBM103280
Substrate/Competitorn/a
Meas. Tech.Inhibition Assay
IC50 3e+1±n/a nM
Citation Halim, RHarding, MHufton, RMorton, CJJahangiri, SPool, BRJeynes, TPDraffan, AGFrey, BLilly, MJ Viral polymerase inhibitors US Patent US8546389 Publication Date 10/1/2013
 
Genome polyprotein
Name:Genome polyprotein
Type:Protein
Mol. Mass.:329637.29
Organism:Hepatitis C virus genotype 3a (isolate NZL1) (HCV)
Description:Q81258
Residue:3021
BDBM103280
NameBDBM103280
Synonyms:US8546389, 235
TypeSmall organic molecule
Emp. Form.C27H33ClN4O5S
Mol. Mass.561.093
SMILESCNC(=O)c1n(nc2cc(N(CCC3COC(C)(C)OC3)S(C)(=O)=O)c(cc12)C1CC1)-c1ccc(Cl)cc1