Reaction Details
TargetEstrogen receptor
LigandBDBM19459
Substrate/Competitorn/a
Meas. Tech.Binding Assay
IC50 4.68e+3±n/a nM
Citation Brinton, RDZhao, L Phytoestrogenic formulations for alleviation or prevention of neurodegenerative diseases US Patent US8552057 Publication Date 10/8/2013
 
Estrogen receptor
Name:Estrogen receptor
Type:Protein
Mol. Mass.:66230.44
Organism:Homo sapiens (Human)
Description:P03372
Residue:595
BDBM19459
NameBDBM19459
Synonyms:5,7-dihydroxy-3-(4-hydroxyphenyl)-4H-chromen-4-one Genistein Genisteol US8552057, 2 | cid_5280961
TypePhytoestrogen
Emp. Form.C15H10O5
Mol. Mass.270.2369
SMILESOc1ccc(cc1)-c1coc2cc(O)cc(O)c2c1=O