Reaction Details
TargetLysine-specific demethylase 5A
LigandBDBM281282
Substrate/Competitorn/a
Meas. Tech.KDM5 Enzyme Assay
pH7±n/a
Temperature298.15±n/a K
IC50 0.025±n/a nM
Commentsextracted
Citation Lai, KWLiang, JZhang, BLabadie, SOrtwine, DDragovich, PKiefer, JGehling, VSHarmange, J Pyrrolidine amide compounds as histone demethylase inhibitors US Patent US10022354 Publication Date 7/17/2018
 
Lysine-specific demethylase 5A
Name:Lysine-specific demethylase 5A
Type:Protein
Mol. Mass.:192091.79
Organism:Homo sapiens (Human)
Description:P29375
Residue:1690
BDBM281282
NameBDBM281282
Synonyms:US10022354, Example 222
TypeSmall organic molecule
Emp. Form.C15H21FN4O2
Mol. Mass.308.3512
SMILESCC(C)c1cc([nH]n1)C(=O)N1CC[C@H](C1)NC(=O)[C@H]1C[C@H]1F