Reaction Details
TargetCarbonic anhydrase 2
LigandBDBM103913
Substrate/Competitorn/a
Meas. Tech.Enzyme Inhibition Assay
pH7.4±0
Temperature298.15±0 K
IC50 770±0.0 nM
Citation Babich, JWZimmerman, CJoyal, JMaresca, KPMarquis, JLu, GWang, JHillier, S Technetium- and rhenium-bis(heteroaryl) complexes and methods of use thereof US Patent US8562945 Publication Date 10/22/2013
 
Carbonic anhydrase 2
Name:Carbonic anhydrase 2
Type:Enzyme
Mol. Mass.:29250.71
Organism:Homo sapiens (Human)
Description:P00918
Residue:260
BDBM103913
NameBDBM103913
Synonyms:US8562945, 248
TypeSmall organic molecule
Emp. Form.C24H30N6O2ReS2
Mol. Mass.684.87
SMILESNOOSc1ccc(NC(=S)NCCCCC[N]23CC4=CC=CC=[N]4[Re+]2[N]2=C(C3)C=CC=C2)cc1