Reaction Details
TargetDipeptidyl peptidase 4
LigandBDBM103918
Substrate/Competitorn/a
Meas. Tech.Enzyme Inhibition Assay
IC50 25400±0.0 nM
Citation Babich, JWZimmerman, CJoyal, JMaresca, KPMarquis, JLu, GWang, JHillier, S Technetium- and rhenium-bis(heteroaryl) complexes and methods of use thereof US Patent US8562945 Publication Date 10/22/2013
 
Dipeptidyl peptidase 4
Name:Dipeptidyl peptidase 4
Type:Enzyme
Mol. Mass.:88271.01
Organism:Homo sapiens (Human)
Description:P27487
Residue:766
BDBM103918
NameBDBM103918
Synonyms:US8562945, 254
TypeSmall organic molecule
Emp. Form.C24H34BN5O4Re
Mol. Mass.653.575
SMILESOB(O)C1CCCN1C(=O)CNC(=O)CCCCC[N]12CC3=CC=CC=[N]3[Re+]1[N]1=C(C2)C=CC=C1