Reaction Details
Target3-phosphoinositide-dependent protein kinase 1
LigandBDBM103920
Substrate/Competitorn/a
Meas. Tech.Binding Assay
IC50 265±n/a nM
Citation Bearss, DJVankayalapati, HSorna, VWarner, SLSharma, S Substituted 3-(1H-benzo[d]imidazol-2-yl)-1H-indazole analogs as inhibitors of the PDK1 kinase US Patent US8569511 Publication Date 10/29/2013
 
3-phosphoinositide-dependent protein kinase 1
Name:3-phosphoinositide-dependent protein kinase 1
Type:Enzyme
Mol. Mass.:63157.65
Organism:Homo sapiens (Human)
Description:O15530
Residue:556
BDBM103920
NameBDBM103920
Synonyms:US8569511, 4
TypeSmall organic molecule
Emp. Form.C25H26F2N6O2
Mol. Mass.480.5097
SMILESFC1(F)CCC(CC1)C(=O)Nc1ccc2[nH]nc(-c3nc4ccc(cc4[nH]3)N3CCOCC3)c2c1