Reaction Details
TargetFucose-binding lectin PA-IIL
LigandBDBM103984
Substrate/Competitorn/a
IC50 2.641e+5± 1.136e+5 nM
Citation Hauck, DJoachim, IFrommeyer, BVarrot, APhilipp, BMöller, HMMöller, AExner, TETitz, A Discovery of two classes of potent glycomimetic inhibitors of Pseudomonas aeruginosa LecB with distinct binding modes. ACS Chem Biol8:1775-84 (2013) 
 
Fucose-binding lectin PA-IIL
Name:Fucose-binding lectin PA-IIL
Type:Protein
Mol. Mass.:11857.84
Organism:Pseudomonas aeruginosa
Description:Q9HYN5
Residue:115
BDBM103984
NameBDBM103984
Synonyms:LecB Inhibitor Triazoles 2b
TypeSmall organic molecule
Emp. Form.C17H23N3O5
Mol. Mass.349.3816
SMILESCOC1O[C@H](Cn2cc(CCc3ccccc3)nn2)[C@@H](O)C(O)[C@@H]1O