Reaction Details
TargetFucose-binding lectin PA-IIL
LigandBDBM103999
Substrate/Competitorn/a
IC50 1.149e+5± 1.94e+4 nM
Citation Hauck, DJoachim, IFrommeyer, BVarrot, APhilipp, BMöller, HMMöller, AExner, TETitz, A Discovery of two classes of potent glycomimetic inhibitors of Pseudomonas aeruginosa LecB with distinct binding modes. ACS Chem Biol8:1775-84 (2013) 
 
Fucose-binding lectin PA-IIL
Name:Fucose-binding lectin PA-IIL
Type:Protein
Mol. Mass.:11857.84
Organism:Pseudomonas aeruginosa
Description:Q9HYN5
Residue:115
BDBM103999
NameBDBM103999
Synonyms:LecB Inhibitor Amines 3c
TypeSmall organic molecule
Emp. Form.C15H20N2O5
Mol. Mass.308.3297
SMILESCOC1O[C@H](CNCc2ccc(cc2)C#N)[C@@H](O)C(O)[C@@H]1O