Reaction Details
TargetFucose-binding lectin PA-IIL
LigandBDBM104002
Substrate/Competitorn/a
IC50 1.59e+4± 3.3e+3 nM
Citation Hauck, DJoachim, IFrommeyer, BVarrot, APhilipp, BMöller, HMMöller, AExner, TETitz, A Discovery of two classes of potent glycomimetic inhibitors of Pseudomonas aeruginosa LecB with distinct binding modes. ACS Chem Biol8:1775-84 (2013) 
 
Fucose-binding lectin PA-IIL
Name:Fucose-binding lectin PA-IIL
Type:Protein
Mol. Mass.:11857.84
Organism:Pseudomonas aeruginosa
Description:Q9HYN5
Residue:115
BDBM104002
NameBDBM104002
Synonyms:LecB Inhibitor Sulfonamides 5a
TypeSmall organic molecule
Emp. Form.C13H19NO7S
Mol. Mass.333.357
SMILESCOC1O[C@H](CNS(=O)(=O)c2ccccc2)[C@@H](O)C(O)[C@@H]1O