Reaction Details
TargetAndrogen receptor
LigandBDBM104026
Substrate/Competitorn/a
Meas. Tech.HDAC Activity Assay
Ki 7.2e+2±n/a nM
IC50 1.08e+3±n/a nM
Citation Gryder, BEAkbashev, MJRood, MKRaftery, EDMeyers, WMDillard, PKhan, SOyelere, AK Selectively targeting prostate cancer with antiandrogen equipped histone deacetylase inhibitors. ACS Chem Biol8:2550-60 (2013) 
 
Androgen receptor
Name:Androgen receptor
Type:Receptor
Mol. Mass.:99185.27
Organism:Homo sapiens (Human)
Description:CHO cells were stably transfected with human AR gene.
Residue:920
BDBM104026
NameBDBM104026
Synonyms:Aryl Nilutamide HDACi analog 14a
TypeSmall organic molecule
Emp. Form.C26H24F3N7O4
Mol. Mass.555.5085
SMILESCC1(C)N(Cc2ccc(cc2)-c2cn(CCCC(=O)NO)nn2)C(=O)N(C1=O)c1ccc(C#N)c(c1)C(F)(F)F