Reaction Details
TargetAndrogen receptor
LigandBDBM104031
Substrate/Competitorn/a
Meas. Tech.HDAC Activity Assay
Ki 1.06e+3±n/a nM
IC50 1.59e+3±n/a nM
Citation Gryder, BEAkbashev, MJRood, MKRaftery, EDMeyers, WMDillard, PKhan, SOyelere, AK Selectively targeting prostate cancer with antiandrogen equipped histone deacetylase inhibitors. ACS Chem Biol8:2550-60 (2013) 
 
Androgen receptor
Name:Androgen receptor
Type:Receptor
Mol. Mass.:99185.27
Organism:Homo sapiens (Human)
Description:CHO cells were stably transfected with human AR gene.
Residue:920
BDBM104031
NameBDBM104031
Synonyms:Aryl Nilutamide HDACi analog 14f
TypeSmall organic molecule
Emp. Form.C31H34F3N7O4
Mol. Mass.625.6414
SMILESCC1(C)N(Cc2ccc(cc2)-c2cn(CCCCCCCCC(=O)NO)nn2)C(=O)N(C1=O)c1ccc(C#N)c(c1)C(F)(F)F