Reaction Details
TargetAP2-associated protein kinase 1
LigandBDBM311265
Substrate/Competitorn/a
Meas. Tech.AAK1 Kinase Assay
IC50 0.300±n/a nM
Citation Luo, G Biaryl kinase inhibitors US Patent US10351563 Publication Date 7/16/2019
 
AP2-associated protein kinase 1
Name:AP2-associated protein kinase 1
Type:PROTEIN
Mol. Mass.:103884.23
Organism:Homo sapiens (Human)
Description:ChEMBL_774569
Residue:961
BDBM311265
NameBDBM311265
Synonyms:(S)-1-((4-(difluoromethyl)-6-(quinolin-4-yl)pyridin-3-yl)oxy)-2,4-dimethylpentan-2-amine US10351563, Example 121 US10723734, Example 121 US9902722, Example 121
TypeSmall organic molecule
Emp. Form.C22H25F2N3O
Mol. Mass.385.4502
SMILESCC(C)C[C@](C)(N)COc1cnc(cc1C(F)F)-c1ccnc2ccccc12