Reaction Details
TargetArachidonate 5-lipoxygenase-activating protein
LigandBDBM104561
Substrate/Competitorn/a
Meas. Tech.Binding Assay
IC50 2.6±0.0 nM
Citation Bartolozzi, ABosanac, TChen, ZDe Lombaert, SDines, JAHuber, JDLiu, WWLoke, PLMorwick, TMOlague, ARiether, DTye, HWu, LZindell, RM Oxadiazole inhibitors of leukotriene production US Patent US8575201 Publication Date 11/5/2013
 
Arachidonate 5-lipoxygenase-activating protein
Name:Arachidonate 5-lipoxygenase-activating protein
Type:Enzyme
Mol. Mass.:18159.90
Organism:Homo sapiens (Human)
Description:P20292
Residue:161
BDBM104561
NameBDBM104561
Synonyms:US8575201, 52
TypeSmall organic molecule
Emp. Form.C25H26N8O3S
Mol. Mass.518.591
SMILESCS(=O)(=O)C1CCN(C1)c1ccc(cn1)-c1nc(no1)C1(CCC1)c1ccc(nc1)-c1cnc(N)nc1