Reaction Details
TargetArachidonate 5-lipoxygenase-activating protein
LigandBDBM104583
Substrate/Competitorn/a
Meas. Tech.Binding Assay
IC50 4.5±0.0 nM
Citation Bartolozzi, ABosanac, TChen, ZDe Lombaert, SDines, JAHuber, JDLiu, WWLoke, PLMorwick, TMOlague, ARiether, DTye, HWu, LZindell, RM Oxadiazole inhibitors of leukotriene production US Patent US8575201 Publication Date 11/5/2013
 
Arachidonate 5-lipoxygenase-activating protein
Name:Arachidonate 5-lipoxygenase-activating protein
Type:Enzyme
Mol. Mass.:18159.90
Organism:Homo sapiens (Human)
Description:P20292
Residue:161
BDBM104583
NameBDBM104583
Synonyms:US8575201, 74
TypeSmall organic molecule
Emp. Form.C21H19N7O
Mol. Mass.385.4219
SMILESCc1ccc(cn1)-c1nc(no1)C1(CCC1)c1ccc(nc1)-c1cnc(N)nc1