Reaction Details
TargetArachidonate 5-lipoxygenase-activating protein
LigandBDBM104621
Substrate/Competitorn/a
Meas. Tech.Binding Assay
IC50 3.3±0.0 nM
Citation Bartolozzi, ABosanac, TChen, ZDe Lombaert, SDines, JAHuber, JDLiu, WWLoke, PLMorwick, TMOlague, ARiether, DTye, HWu, LZindell, RM Oxadiazole inhibitors of leukotriene production US Patent US8575201 Publication Date 11/5/2013
 
Arachidonate 5-lipoxygenase-activating protein
Name:Arachidonate 5-lipoxygenase-activating protein
Type:Enzyme
Mol. Mass.:18159.90
Organism:Homo sapiens (Human)
Description:P20292
Residue:161
BDBM104621
NameBDBM104621
Synonyms:US8575201, 112
TypeSmall organic molecule
Emp. Form.C24H24N8O
Mol. Mass.440.5004
SMILESNc1ncc(cn1)-c1ccc(cn1)C1(CCC1)c1noc(n1)-c1ccc(nc1)N1CCCC1