Reaction Details
TargetSuppressor of tumorigenicity 14 protein
LigandBDBM104931
Substrate/Competitorn/a
Meas. Tech.Inhibition Assay
Ki 0.7±0.0 nM
Citation Steinmetzer, TSchweinitz, ADonnecke, D Meta-substituted phenyl sulfonyl amides of secondary amino acid amides, the production thereof, and use thereof as matriptase inhibitors US Patent US8569313 Publication Date 10/29/2013
 
Suppressor of tumorigenicity 14 protein
Name:Suppressor of tumorigenicity 14 protein
Type:Single-pass type II membrane protein
Mol. Mass.:94769.23
Organism:Homo sapiens (Human)
Description:Q9Y5Y6
Residue:855
BDBM104931
NameBDBM104931
Synonyms:US8569313, Inhibitor 48
TypeSmall organic molecule
Emp. Form.C32H38N6O6S
Mol. Mass.634.746
SMILESNCCC(=O)Nc1cccc(c1)S(=O)(=O)N[C@@H](Cc1cccc(c1)C(N)=N)C(=O)N1CCC(CC1)C(=O)OCc1ccccc1