Reaction Details
TargetLeucine-rich repeat serine/threonine-protein kinase 2
LigandBDBM41571
Substrate/Competitorn/a
Meas. Tech.In Vitro Inhibition Assay
Ki 0.3±n/a nM
Citation Chan, BKChen, HEstrada, AShore, DSweeney, ZMcIver, EG Compounds and their administration for treating a neurodegenerative disease as well as a method for identifying a compound capable of inhibiting a kinase, such as LRRK US Patent US8569281 Publication Date 10/29/2013
 
Leucine-rich repeat serine/threonine-protein kinase 2
Name:Leucine-rich repeat serine/threonine-protein kinase 2
Type:Protein
Mol. Mass.:286113.20
Organism:Homo sapiens (Human)
Description:Q5S007
Residue:2527
BDBM41571
NameBDBM41571
Synonyms:US8569281, 52
Typen/a
Emp. Form.C18H21N5O
Mol. Mass.323.3922
SMILESCn1cc(\C=C\c2n[nH]c3ccnc(OC4CCCCC4)c23)cn1