Reaction Details
Target3-phosphoinositide-dependent protein kinase 1
LigandBDBM105294
Substrate/Competitorn/a
Meas. Tech.Kinase Assay
IC50 2±0.0 nM
Citation Engelhardt, HKofink, CMcConnell, D Chemical compounds US Patent US8575203 Publication Date 11/5/2013
 
3-phosphoinositide-dependent protein kinase 1
Name:3-phosphoinositide-dependent protein kinase 1
Type:Enzyme
Mol. Mass.:63157.65
Organism:Homo sapiens (Human)
Description:O15530
Residue:556
BDBM105294
NameBDBM105294
Synonyms:US8575203, I-61
TypeSmall organic molecule
Emp. Form.C39H44FN7O3
Mol. Mass.677.8102
SMILESOC[C@H](c1cccc(F)c1)n1cccc(C(=O)NCC#Cc2ccc3ncc(N[C@H]4CC[C@@H](CC4)N4CCN(CC5CC5)CC4)nc3c2)c1=O