Reaction Details
Target3-phosphoinositide-dependent protein kinase 1
LigandBDBM105308
Substrate/Competitorn/a
Meas. Tech.Kinase Assay
IC50 1±0.0 nM
Citation Engelhardt, HKofink, CMcConnell, D Chemical compounds US Patent US8575203 Publication Date 11/5/2013
 
3-phosphoinositide-dependent protein kinase 1
Name:3-phosphoinositide-dependent protein kinase 1
Type:Enzyme
Mol. Mass.:63157.65
Organism:Homo sapiens (Human)
Description:O15530
Residue:556
BDBM105308
NameBDBM105308
Synonyms:US8575203, I-75
TypeSmall organic molecule
Emp. Form.C33H33F2N5O2
Mol. Mass.569.6442
SMILESCCN1CCC(CC1)Nc1cnc2ccc(cc2c1)C#CCNC(=O)c1cccn([C@@H](C)c2ccc(F)c(F)c2)c1=O